Tiene componente
sub property of: hasPart
comment: س <يحتوي على> ع. الكائن س هو جزء من ع بالكامل وله أيضاً وجود مستقل عن ع. على سبيل المثال: "الأشجار" <تحتوي على > "الأوراق" " منظومات المركبات" <تحتوي على > "المحركات". @ar
comment: Y<有组成部分>X。物体X是整体Y的一部分，同时也独立于Y存在。例如：“树”<有组成部分>“叶”，“车辆系统”<有组成部分>“发动机”。 @zh
comment: Y <имеет компонент> X. Объект X, который является частью целого Y и также имеет существование независимо от Y. Например, "деревья" <имеет компонент "листья", "системы машин" <имеет компонент> "двигатели". @ru
comment: Y <tiene componente> X. Un objeto X que es una parte de un todo Y y tiene también una existencia independiente de Y. Ex. Par exemple, "Árboles" <tiene componente> "Hojas", "Componentes del vehículo" <tiene componente> "Motores".
comment: Y <has component> X. An object X that is a part of a whole Y and also has an existence independently from Y. E.g. "trees" <has component> "leaves", "vehicle systems" <has component> "engines". @en
comment: Y <a le composant> X. Un objet X qui fait partie d'un Y entier et a également une existence indépendamment de Y. Par exemple, "arbre" <a le composant> "feuille", "organe de véhicule" <a le composant> "moteur". @fr
label: 有组成部分 @zh
label: مكون @ar
label: имеет компонент @ru
label: Has component @en
label: A le composant @fr

Está afectado por
sub property of: causativeRelationship
comment: ع <يتأثر بـ >س . يغير الكائن "ع" حالته أو موقعه بسبب إجراء قام به العامل "س". على سبيل المثال. "الأشجار" تتأثر بـ "مبيدات الشجر" ، "جودة النقل" تتأثر "بالضرر الميكانيكي". لا تستخدم للأمراض أو الاضطرابات. لهؤلاء استخدم <afflicts / isAfflictedBy>. @ar
comment: на Y влияет X. Объект Y изменяет состояние или местоположение из-за действия агента X. Например, на "деревья" влияет "арборициды", на "качество транспортировки" влияет "механические повреждения". Не используйте для болезней или расстройств; для них используйте <поражает/на ... негативно влияет болезнь .....>. @ru
comment: Y<受...影响> X。对象Y的状态或位置由于媒介X的行为而发生变化。例如：“树”<受...影响>“树木毒杀剂”，“运输性能”<受...影响>“机械损伤”。 请勿用于疾病或病症；对于疾病和病症，使用<损伤/受...损伤>。 @zh
comment: Y <is affected by> X. An object Y changes state or location because of an action of an agent X. E.g. "trees" <is affected by> "arboricides", "transporting quality" <is affected by> "mechanical damage". Do not use for diseases or disorders; for those, use <afflicts/is afflicted by>. @en
comment: Y <está afectado por> X. Un objeto Y cambia de estado o ubicación debido a la acción de un agente X. Ej. "Árbol" <está afectado por> "Arboricida", "Aptitud para el transporte" <está afectado por> "Daño mecánico". No lo utilice para enfermedades o trastornos; para ellos, utilice <aflige/está afligido por>.
comment: Y <est affecté par> X. Un objet Y change d'état ou de localisation suite à l'action d'un agent X. Par exemple, "arbre" <est affecté par> "arboricide", "aptitude au transport" <est affecté par> "dégât mécanique". Ne l'utilisez pas pour des maladies ou des désordres: pour ceux-là, utilisez <afflige/est affligé par>. @fr
label: 受...影响 @zh
label: يتأثر بها @ar
label: на ... влияет .... @ru
label: Is affected by @en
label: Est affecté par @fr

Es componente de
sub property of: isPartOf
comment: س <هي مكون من> ع. الكائن س هو جزء من ع بالكامل وله أيضاً وجود مستقل عن ع. على سبيل المثال: "الورقة" <هي مكون من > "الشجرة" " المحركات" <هي مكون من > "منظومات المركبات". @ar
comment: X <является компонентом> Y. Объект X, который является частью целого Y, также имеет существование независимо от Y. Например, "листья" <является компонентом> "деревья", "двигатели" <является компонентом> "системы машин". @ru
comment: X <est un composant de> Y. Un objet X qui fait partie d'un Y entier, a également une existence indépendante de Y. Par exemple, "feuille" <est un composant de> "arbre", "moteur" <est un composant de> "organe de véhicule" . @fr
comment: X <es componente de> Y. Un objeto X que forma parte de un conjunto Y, también tiene una existencia independiente de Y. Ej. "Hoja" <es componente de> "Árbol", "Motore" <es componente de> "Componente del vehículo".
comment: X<是...的组成部分>Y。物体X是整体Y的一部分，同时也独立于Y存在。例如：“叶”<是...的组成部分>“树”，“发动机”<是...的组成部分>“车辆系统”。 @zh
comment: X <is component of> Y. An object X that is a part of a whole Y, also has an existence independently from Y. E.g. "leaves" <is component of> "trees", "engines" <is component of> "vehicle systems". @en
label: 是...的组成部分 @zh
label: هو مكون من @ar
label: является компонентом @ru
label: Is component of @en
label: Est un composant de @fr

Afecta
sub property of: causativeRelationship
comment: س <يؤثر على> ع. أي إجراء من العامل س يؤدي إلى تغيير حالة أو موقع ع على سبيل المثال: "نضوب المياه" <يؤثر على> "منسوب المياه الجوفية" "الضرر الميكانيكي" <يؤثر على> "جودة النقل" لا تستخدم للأمراض أو الاضطرابات. لهؤلاء استخدم <afflicts / isAfflictedBy>. @ar
comment: X<影响> Y。媒介X的行为改变Y的状态或位置。例如：“水枯竭”<影响> “地下水位”，“机械损伤”<影响> “运输性能”。请勿用于疾病或病症；对于疾病和病症，使用<损害/受...损害>。 @zh
comment: X <влияет на> Y. Действие агента X изменяет состояние или местоположение Y. Например, "истощение водных ресурсов" <влияет на> "уровень грунтовых вод", "механические повреждения" <влияют на> "пригодность к транспортировке". Не используйте для болезней или расстройств; для них используйте <поражает/на ... негативно влияет болезнь .....>. @ru
comment: X <affects> Y. Action of agent X changes the state or location of Y. E.g. "water depletion" <affects> "groundwater table", "mechanical damage" <affects> “transporting quality”. Do not use for diseases or disorders; for those, use <afflicts/is afflicted by>. @en
comment: X <affecte> Y. L'agent X agit sur l'objet Y de telle sorte que Y change d'état ou de localisation. Par exemple, "tarissement" <affecte> "nappe souterraine", "dégât mécanique" <affecte> "aptitude au transport". Ne l'utilisez pas pour des maladies ou des désordres : pour ceux-là, utilisez <afflige/est affligé par>. @fr
comment: X <afecta> Y. La acción del agente X cambia el estado o la ubicación de Y. Ej. "Agotamiento del agua" <afecta> "Capa freática", "Daño mecánico" <afecta> "Aptitud para el transporte". No lo utilice para enfermedades o trastornos; para ellos, utilice <aflige/está afligido por>.
label: يؤثر @ar
label: влияет на @ru
label: Affects @en
label: Affecte @fr
label: 影响 @zh

Tiene objeto de la actividad
sub property of: processRelationship
comment: س <له هدف النشاط> ع. يركز النشاط س على ع. على سبيل المثال "الجز" <له هدف> "الصوف" ، "التصديق" <له هدف> "المعاهدات". @ar
comment: X <有活动对象> Y。活动X关注对象Y。例如：“剪毛”<有活动对象>“羊毛”，“批准”<有活动对象>“条约”。 @zh
comment: X <имеет объект деятельности> Y. Действие X сосредоточено на Y. Например, "стрижка" <имеет объект деятельности> "шерсть", "ратификация" <имеет объект деятельности> "пакты". @ru
comment: X <tiene objeto de la actividad> Y. El concepto X es el foco de la actividad Y.Ej. “Esquileo” <tiene objeto de la actividad> “Lana”, “Ratificación” <tiene objeto de la actividad> “Tratado”.
comment: X <has object of activity> Y. Activity X focuses on Y. E.g. “shearing” <has object of activity> “wool”, “ratification” <has object of activity> “treaties”. @en
comment: X <a objet d'activité> Y. Le concept X est au centre de l'activité Y. "tonte" <a objet d'activité> "laine", "ratification" <a objet d'activité> "traité". @fr
label: 有活动对象 @zh
label: له هدف النشاط @ar
label: имеет объект деятельности @ru
label: Has object of activity @en
label: A objet d'activité @fr

Tiene propriedad
sub property of: causativeRelationship
comment: س <لديه خاصية> ع. الخاصية قد تكون جودة أو ميزة. على سبيل المثال: البذرة"<لديها خاصية> "حجم البذرة" "النباتات الطبية" <لديها خاصية> "الخصائص الطبية" @ar
comment: X<有属性>Y。属性可以是一种性质或特点。例如：“种子”<有属性>“种子大小”和“种子活力”，“药用植物类” <有属性>“药物属性”。 @zh
comment: X <обладает свойством> Y. Свойство может быть качеством или признаком. Например, "семенной материал" <обладает свойством> "крупность семян", "лекарственные растения" <обладает свойством> "фармакологические свойства". @ru
comment: X <tiene propriedad> Y. Una propiedad puede ser una cualidad o un rasgo. Ej. “Semilla” <tiene propriedad> “Tamaño de la semilla", “Planta medicinal” <tiene propriedad> “Propiedad medicinal”.
comment: X <has property> Y. A property might be a quality or trait. E.g. “seed” <has property> “seed size", “medicinal plants” <has property> “medicinal properties”. @en
comment: X <a la propriété> Y. Une propriété peut être une qualité ou un trait. Par exemple, "semence" <a la propriété> "grosseur des semences", "plante médicinale" <a la propriété> "propriété pharmacologique". @fr
label: 有属性 @zh
label: لديه ممتلكات @ar
label: обладает свойством @ru
label: Has property @en
label: A la propriété @fr

Incluye
sub property of: partitiveRelationship
comment: س <يتضمن> ع. س هو كيان يتضمن العنصر ع على سبيل المثال: "طرق رعاية الحيوان" <تتضمن> "عملية إزالة القرون" "تحليل المياه" <تتضمن> " تخصيص الموارد" @ar
comment: X<包含>Y。实体X包含元素Y。例如：“家畜饲养方法”<包含>“断角术”，“水分析”<包含>“微生物分析”。 @zh
comment: X <включает> Y. X - это сущность, которая включает элемент Y. Например, "методы выращивания и содержания животных" <включает> "удаление рогов", "анализ воды" <включает> "микробиологический анализ". @ru
comment: X <incluye> Y. X es una entidad que incluye el elemento Y. Ej. "Método de crianza" <incluye> "Descorne", " Análisis de agua" <incluye> "Análisis microbiológico".
comment: X <includes> Y. X is an entity that includes the element Y. For example: “animal husbandry methods” <includes> ”dehorning”, “water analysis” <includes> ”microbiological analysis”. @en
comment: X <comprend> Y. X est une entité qui inclut l'élément Y. Par exemple, "méthode d'élevage" <comprend> "écornage", "analyse de l'eau" <comprend> "analyse microbiologique". @fr
label: 包含 @zh
label: يشمل @ar
label: включает @ru
label: Includes @en
label: Comprend @fr

Hace uso de
sub property of: processRelationship
comment: ع <يستفد من> س. يستفيدالنشاط ع من العملية أو الإدخال س. على سبيل المثال "لملاحة" <تستفيد من> "المساعدات الملاحية"، "الزراعة الدقيقة " <تستفيد من> "نظم المعلومات الجغرافية". "النقل بالسكك الحديدية" <تستفيد من> " القطارات" @ar
comment: Y<利用>X。活动Y使用过程或投入物X。例如：“航海”<利用>“导航设备”，“精准农业”<利用>“地理信息系统”，“铁路运输”<利用>“火车”。 @zh
comment: Y <использует> X. Действие Y использует процесс, оборудование или данные X. Например, "навигация" <использует> "навигационное оборудование", "точное сельское хозяйство" <использует> "географические информационные системы", "сварка" <использует> "сварочное обрудование". @ru
comment: Y <make use of> X. Activity Y makes use of process or input X. E.g. “navigation” <make use of> ”navigational aids”, “precision agriculture” <make use of> ”geographical information systems”, “rail transport” <make use of> “trains”. @en
comment: Y <hace uso de> X. La actividad Y utiliza el proceso o la entrada X. Ej. "Navegación" <hace uso de> "Ayuda a la navegación", "Agricultura de precisión" <hace uso de> "Sistemas de información geográfica", "Transporte por ferrocarrilese" <hace uso de> "Trenes".
comment: Y <fait usage de> X. L'activité Y utilise le processus ou l'intrant X. Par exemple, "navigation" <fait usage de> "aide à la navigation", "agriculture de précision" <fait usage de> "système d'information géographique", "transport ferroviaire" <fait usage de> "train". @fr
label: يستفاد من @ar
label: использует @ru
label: Make use of @en
label: Fait usage de @fr
label: 利用 @zh

AGROVOC
type: ConceptScheme

obtention végétale
type: Label
in dataset: Agrovoc
created: 1989-09-27T00:00:00Z
has related term: amélioration des plantes
modified: 2021-05-24T17:34:42Z
notation: 27790

اصلاح نباتات
type: Label
in dataset: Agrovoc
created: 2007-04-20T00:00:00Z
has related term: اصلاح نژاد گیاهی
notation: 66703

Obtención vegetal
type: Label
in dataset: Agrovoc
created: 1989-09-27T00:00:00Z
has related term: Fitomejoramiento
notation: 27790

Mejoramiento genético de plantas
type: Label
in dataset: Agrovoc
created: 1987-04-14T00:00:00Z
has related term: Fitomejoramiento
notation: 22939

Mejoramiento de plantas
type: Label
in dataset: Agrovoc
created: 1987-04-14T00:00:00Z
has related term: Fitomejoramiento
notation: 22938

селекцыя раслін
type: Label
in dataset: Agrovoc
created: 2024-01-16T07:05:02
notation: 5956

kuzaliana kwa mimea
type: Label
in dataset: Agrovoc
created: 2023-11-29T14:50:42Z
notation: 5956

melhoramento de plantas
type: Label
in dataset: Agrovoc
created: 2021-09-29T20:35:42Z
notation: 5956

ameliorarea plantelor
type: Label
in dataset: Agrovoc
created: 2015-11-20T07:37:45Z
modified: 2015-11-27T22:07:34Z
notation: 5956

селекція рослин
type: Label
in dataset: Agrovoc
created: 2014-11-14T21:16:32Z
modified: 2015-01-26T20:37:49Z
notation: 5956

Pembiakan tumbuhan
type: Label
in dataset: Agrovoc
created: 2012-05-09T10:45:47Z
modified: 2013-08-22T15:15:57Z
notation: 1336531547456

bitki ıslahı
type: Label
in dataset: Agrovoc
created: 2011-11-20T20:20:56Z
modified: 2014-07-03T19:03:54Z
notation: 5956

植物育种
type: Label
in dataset: Agrovoc
created: 2002-12-12T00:00:00Z
notation: 5956

การปรับปรุงพันธุ์พืช
type: Label
in dataset: Agrovoc
created: 2005-08-19T00:00:00Z
notation: 5956

šľachtenie rastlín
type: Label
in dataset: Agrovoc
created: 2005-12-16T00:00:00Z
notation: 5956

селекция растений
type: Label
in dataset: Agrovoc
created: 2008-03-03T00:00:00Z
notation: 5956

melhoramento de plantas
type: Label
in dataset: Agrovoc
created: 1998-08-04T00:00:00Z
modified: 2021-06-16T21:24:42Z
notation: 5956

Hodowla roślin
type: Label
in dataset: Agrovoc
created: 2006-12-19T00:00:00Z
notation: 5956

ການປັບປຸງພັນພືດ
type: Label
in dataset: Agrovoc
created: 2005-12-16T00:00:00Z
notation: 5956

식물육종
type: Label
in dataset: Agrovoc
created: 2009-12-02T00:00:00Z
notation: 5956

植物育種
type: Label
in dataset: Agrovoc
created: 2005-08-09T00:00:00Z
notation: 5956

Miglioramento genetico vegetale
type: Label
in dataset: Agrovoc
created: 2006-10-20T00:00:00Z
notation: 5956

növénynemesítés
type: Label
in dataset: Agrovoc
created: 2006-12-06T00:00:00Z
notation: 5956

पौध-प्रजनन
type: Label
in dataset: Agrovoc
created: 1981-01-09T00:00:00Z
notation: 5956

amélioration des plantes
type: Label
in dataset: Agrovoc
created: 1981-01-21T00:00:00Z
has related term: obtention végétale
modified: 2021-05-24T17:34:42Z
notation: 5956

اصلاح نژاد گیاهی
type: Label
in dataset: Agrovoc
created: 2007-04-20T00:00:00Z
has related term: اصلاح نباتات
notation: 5956

Fitomejoramiento
type: Label
in dataset: Agrovoc
created: 1981-01-23T00:00:00Z
has related term: Obtención vegetal
has related term: Mejoramiento genético de plantas
has related term: Mejoramiento de plantas
notation: 5956

plant breeding
type: Label
in dataset: Agrovoc
created: 1981-01-09T00:00:00Z
notation: 5956

Pflanzenzüchtung
type: Label
in dataset: Agrovoc
created: 1996-12-24T00:00:00Z
modified: 2019-11-15T14:45:00Z
notation: 5956

šlechtění rostlin
type: Label
in dataset: Agrovoc
created: 2003-03-27T00:00:00Z
notation: 5956

تربية النبات
type: Label
in dataset: Agrovoc
created: 2002-12-12T00:00:00Z
notation: 5956

Bitkilerin genetik yönden düzenlenmesi ve mevcut çeşitlilikten yararlanarak insanlığın yararına istenilen yönde bitkileri geliştirilmesidir.
has source: Türkçe AGROVOC Ekibi
created: 2023-04-28T14:35:28

Plant breeding is the science of genetically improving plants for the benefit of humankind.
has source: Introduction to Pre-breeding, FAO e-learning, 2019
created: 2022-03-28T10:41:51

prefLabel
comment: A resource has no more than one value of skos:prefLabel per language tag. @en

Fitomejoramiento
type: Concept
narrower: Fitomejoramiento participativo
narrower: Domesticación de plantas
Tiene componente: Variedad naturalizada
Tiene componente: Variedad indígena
Tiene componente: Ensayo de procedencias
Está afectado por: Herencia genética
alternative label: obtention végétale @fr
alternative label: اصلاح نباتات @fa
alternative label: Obtención vegetal
alternative label: Mejoramiento genético de plantas
alternative label: Mejoramiento de plantas
in dataset: Agrovoc
Es componente de: генетыка раслін
created: 2011-11-20T20:20:56Z
Afecta: Mejora de cultivos
Tiene objeto de la actividad: Germoplasma mejorado
Tiene propriedad: Derecho sobre producto cruzamiento
Incluye: Introducción de plantas
Incluye: Método haploide
Hace uso de: Biotecnología vegetal
related: Centro de origen
related: Genotipado mediante secuenciación
in scheme: AGROVOC
alt label: obtention végétale
alt label: اصلاح نباتات
alt label: Obtención vegetal
alt label: Mejoramiento genético de plantas
alt label: Mejoramiento de plantas
pref label: селекцыя раслін
pref label: kuzaliana kwa mimea
pref label: melhoramento de plantas
pref label: ameliorarea plantelor
pref label: Pembiakan tumbuhan
pref label: bitki ıslahı
pref label: 植物育种
pref label: การปรับปรุงพันธุ์พืช
pref label: šľachtenie rastlín
pref label: селекция растений
pref label: Hodowla roślin
pref label: ການປັບປຸງພັນພືດ
pref label: 식물육종
pref label: 植物育種
pref label: Miglioramento genetico vegetale
pref label: növénynemesítés
pref label: पौध-प्रजनन
pref label: amélioration des plantes
pref label: اصلاح نژاد گیاهی
pref label: Fitomejoramiento
pref label: plant breeding
pref label: Pflanzenzüchtung
pref label: šlechtění rostlin
definition: Bitkilerin genetik yönden düzenlenmesi ve mevcut çeşitlilikten yararlanarak insanlığın yararına istenilen yönde bitkileri geliştirilmesidir.
definition: Plant breeding is the science of genetically improving plants for the benefit of humankind.
preferred label: селекцыя раслін @be
preferred label: kuzaliana kwa mimea @sw
preferred label: melhoramento de plantas @pt-br
preferred label: ameliorarea plantelor @ro
preferred label: селекція рослин @uk
preferred label: Pembiakan tumbuhan @ms
preferred label: bitki ıslahı @tr
preferred label: 植物育种 @zh
preferred label: การปรับปรุงพันธุ์พืช @th
preferred label: šľachtenie rastlín @sk
preferred label: селекция растений @ru
preferred label: Hodowla roślin @pl
preferred label: تربية النبات @ar
preferred label: šlechtění rostlin @cs
preferred label: Pflanzenzüchtung @de
preferred label: plant breeding @en
preferred label: اصلاح نژاد گیاهی @fa
preferred label: amélioration des plantes @fr
preferred label: पौध-प्रजनन @hi
preferred label: növénynemesítés @hu
preferred label: Miglioramento genetico vegetale @it
preferred label: 植物育種 @ja
preferred label: 식물육종 @ko
preferred label: ການປັບປຸງພັນພືດ @lo
modified: 2025-07-24T08:42:18
broader: Mejora

Fitomejoramiento participativo
type: Concept
preferred label: melhoramento participativo de plantas @pt-br
preferred label: ufugaji shirikishi wa mimea @sw
preferred label: Selezione vegetale partecipativa @it
preferred label: katılımcı bitki ıslahı @tr
preferred label: 参与式植物育种 @zh
preferred label: коллективная селекция растений @ru
preferred label: sélection végétale participative @fr
preferred label: تربية تشاركية للنباتات @ar
preferred label: participatory plant breeding @en
broader: Fitomejoramiento

Domesticación de plantas
type: Concept
preferred label: domesticação de plantas @pt-br
preferred label: mtumishi wa nyumbani ya mmea @sw
preferred label: даместыкацыя раслін @be
preferred label: تدجين النباتات @ar
preferred label: მცენარეების გაკულტურება @ka
preferred label: domesticirea plantelor @ro
preferred label: доместикація рослин @uk
preferred label: Penjinakan tumbuhan @ms
preferred label: bitki evcilleştirme @tr
preferred label: 植物驯化 @zh
preferred label: การนำพืชมาปลูกในท้องถิ่น @th
preferred label: domestikace rostlin @cs
preferred label: Pflanzendomestikation @de
preferred label: plant domestication @en
preferred label: بومی‌کردن گیاه @fa
preferred label: domestication des plantes @fr
preferred label: पौध-पालन(पालतू बनाना) @hi
preferred label: növény háziasítása @hu
preferred label: Domesticazione delle piante @it
preferred label: 植物の順化 @ja
preferred label: ການນຳເອົາພືດປ່າມາປູກ @lo
preferred label: Udomowienie roślin @pl
preferred label: доместикация растений @ru
broader: Fitomejoramiento

Variedad naturalizada
type: Concept
preferred label: namna zilizoletwa @sw
preferred label: інтрадукаваны сорт @be
preferred label: შემოტანილი სახესხვაობა @ka
preferred label: інтродуковані сорти @uk
preferred label: soiuri introduse @ro
preferred label: ప్రతిస్థాపిత రకాలు @te
preferred label: yabancı çeşit @tr
preferred label: 引进品种(植物) @zh
preferred label: พันธุ์นำเข้า @th
preferred label: introdukované odrody @sk
preferred label: أصناف مجلوبة @ar
preferred label: introdukované odrůdy @cs
preferred label: eingeführte Sorte @de
preferred label: introduced varieties @en
preferred label: ارقام واردشده @fa
preferred label: variété introduite @fr
preferred label: पुर: स्थापित किस्म @hi
preferred label: betelepített változat @hu
preferred label: Varietà introdotte @it
preferred label: 導入品種、外来品種（作物） @ja
preferred label: ພັນນຳເຂົ້າ @lo
preferred label: Odmiana introdukowana @pl
preferred label: variedade introduzida @pt
preferred label: интродуцированные сорта @ru
Es componente de: Fitomejoramiento

Variedad indígena
type: Concept
preferred label: tofauti za ardhi @sw
preferred label: мясцовыя сарты @be
preferred label: місцеві сорти @uk
preferred label: ప్రాంతీయ రకాలు @te
preferred label: yerli çeşit @tr
preferred label: 地方品种(植物) @zh
preferred label: พันธุ์ดั้งเดิม @th
preferred label: krajové odrody @sk
preferred label: أصناف الأراضي @ar
preferred label: krajové odrůdy @cs
preferred label: Landsorte @de
preferred label: land varieties @en
preferred label: ارقام بومی @fa
preferred label: variété indigène @fr
preferred label: पुरानी प्रजातियाँ @hi
preferred label: tájfajta @hu
preferred label: Varietà indigene @it
preferred label: 在来品種 @ja
preferred label: ພັນດັ້ງເດີມ @lo
preferred label: Odmiana miejscowa roślin @pl
preferred label: variedade indígena @pt
preferred label: местные сорта @ru
Es componente de: Fitomejoramiento

Ensayo de procedencias
type: Concept
preferred label: выпрабаванне паходжання @be
preferred label: teste de proveniență @ro
preferred label: majaribio ya asili @sw
preferred label: menşe belirleme @tr
preferred label: 原产地试验 @zh
preferred label: การตรวจสอบแหล่งกำเนิด @th
preferred label: تجارب على المصادر @ar
preferred label: provenienční pokusy @cs
preferred label: Provenienzversuch @de
preferred label: provenance trials @en
preferred label: کارآزمایی‌های زادگاه @fa
preferred label: essai de provenances @fr
preferred label: प्रमाणिक परीक्षण @hi
preferred label: eredetvizsgálat @hu
preferred label: Prove di provenienza @it
preferred label: 原産地試験 @ja
preferred label: ການຮຽນຮູ້ກ່ຽວກັບແຫຼ່ງກຳເນີດ @lo
preferred label: Badanie proweniencyjne @pl
preferred label: ensaio de proveniência @pt
preferred label: эколого-географические испытания @ru
Es componente de: Fitomejoramiento

Herencia genética
type: Concept
preferred label: herança genética @pt-br
preferred label: urithi wa kijenetiki @sw
preferred label: генетычнае наследаванне @be
preferred label: генетична спадковість @uk
preferred label: ereditate @ro
preferred label: వారసత్వం @te
preferred label: genetik miras @tr
preferred label: 基因遗传 @zh
preferred label: การถ่ายทอดทางพันธุกรรม @th
preferred label: genetická dedičnosť @sk
preferred label: генетическое наследование @ru
preferred label: وراثة نسلية @ar
preferred label: genetická dědičnost @cs
preferred label: Vererbung @de
preferred label: genetic inheritance @en
preferred label: توارث ژنتیکی @fa
preferred label: hérédité @fr
preferred label: अनुवांशिकी विरासत @hi
preferred label: genetikai öröklődés @hu
preferred label: Eredità genetica @it
preferred label: 遺伝的相続 @ja
preferred label: ການຖ່າຍທອດທາງດ້ານກຳມະພັນ @lo
preferred label: Dziedziczenie genetyczne @pl
preferred label: hereditariedade genética @pt
Afecta: Fitomejoramiento

генетыка раслін
type: Concept
preferred label: Fitogenética
preferred label: genetik ya mimea @sw
preferred label: الموارد الوراثية النباتية @ar
preferred label: genetika rostlin @cs
preferred label: plant genetics @en
preferred label: phytogénétique @fr
preferred label: 식물유전학 @ko
preferred label: генетика растений @ru
preferred label: 植物遗传学 @zh
preferred label: bitki genetiği @tr
preferred label: Pflanzengenetik @de
preferred label: Fitogenetica @it
preferred label: genetică vegetală @ro
preferred label: генетика рослин @uk
preferred label: მცენარეთა გენეტიკა @ka
Tiene componente: Fitomejoramiento

Mejora de cultivos
type: Concept
preferred label: 作物改良 @zh
preferred label: паляпшэнне сельскагаспадарчых культур @be
preferred label: uboreshaji wa mazao @sw
preferred label: تحسين المحاصيل @ar
preferred label: генетическое улучшение культурных растений @ru
preferred label: Miglioramento delle colture @it
preferred label: поліпшення сільськогосподарських культур @uk
preferred label: bitki iyileştirme @tr
preferred label: Verbesserung von Nutzpflanzen @de
preferred label: zlepšení plodin @cs
preferred label: amélioration des cultures @fr
preferred label: crop improvement @en
Está afectado por: Fitomejoramiento

Germoplasma mejorado
type: Concept
preferred label: 改良种质 @zh
preferred label: improved germplasm @en
preferred label: улучшенная зародышевая плазма @ru
preferred label: matériel génétique amélioré @fr
preferred label: forbedret genetisk materiale @nb
preferred label: förbättrat genetiskt material @sv
preferred label: material genético melhorado @pt-br
preferred label: verbeterd genetisch materiaal @nl
preferred label: geliştirilmiş genetik materyal @tr
preferred label: покращена зародкова плазма @uk
preferred label: المادة الوراثية المحسنة @ar
preferred label: kuendeleza wa germplasm @sw
is object of activity: Fitomejoramiento

Derecho sobre producto cruzamiento
type: Concept
preferred label: правы селекцыянераў @be
preferred label: haki za wafugaji @sw
preferred label: drept de ameliorator @ro
preferred label: కోరకాల నిర్మూలన @te
preferred label: ıslahçı hakkı @tr
preferred label: 育种者权利 @zh
preferred label: สิทธินักปรับปรุงพันธุ์ @th
preferred label: práva šľachtiteľov @sk
preferred label: права селекционеров @ru
preferred label: direito de obtentor @pt
preferred label: حقوق المربين @ar
preferred label: práva šlechtitelů @cs
preferred label: Züchterrecht @de
preferred label: breeders rights @en
preferred label: حقوق به‌نژادگران @fa
preferred label: droit de l'obtenteur @fr
preferred label: प्रजनक अधिकार @hi
preferred label: nemesítői jog @hu
preferred label: Diritti dei genetisti @it
preferred label: 育成者権利 @ja
preferred label: 육종특허권 @ko
preferred label: ລິຂະສິດຜູ້ຜະລິດສາຍພັນ @lo
preferred label: Prawo hodowcy @pl
is property of: Fitomejoramiento

Introducción de plantas
type: Concept
preferred label: kuanzishwa kwa mmea @sw
preferred label: introdução de plantas @pt-br
preferred label: introducerea plantelor @ro
preferred label: bitki introdüksiyonu @tr
preferred label: 植物引种 @zh
preferred label: การนำเข้าพรรณพืช @th
preferred label: introdukcia rastlín @sk
preferred label: интродукция растений @ru
preferred label: إدخال النباتات @ar
preferred label: introdukce rostlin @cs
preferred label: Pflanzeneinführung @de
preferred label: plant introduction @en
preferred label: ورود گیاه @fa
preferred label: introduction de plantes @fr
preferred label: पौध / पादप पुरःस्थापन @hi
preferred label: növény bevezetése @hu
preferred label: Introduzione di piante @it
preferred label: 植物導入 @ja
preferred label: 식물도입 @ko
preferred label: ການນຳພືດເຂົ້າມາປູກ @lo
preferred label: Introdukcja roślin @pl
is included in: Fitomejoramiento

Método haploide
type: Concept
preferred label: mbinu za haplo @sw
preferred label: haplo-metot @tr
preferred label: 单一方法 @zh
preferred label: ฮาโพลเมททอต @th
preferred label: haploidizácia @sk
preferred label: гаплометоды @ru
preferred label: طرق فردانية @ar
preferred label: haploidizace @cs
preferred label: Haploidentechnik @de
preferred label: haplomethods @en
preferred label: روش‌های تک‌لادی @fa
preferred label: haplométhode @fr
preferred label: अगुणिता विधियाँ @hi
preferred label: haploid módszer @hu
preferred label: Metodi aploidi @it
preferred label: 半数体法 @ja
preferred label: ຮາໂພລເທດທອດ @lo
preferred label: Metoda haploidów @pl
preferred label: método de indução de haplóides @pt
is included in: Fitomejoramiento

Biotecnología vegetal
type: Concept
preferred label: Biotecnologia vegetal @ca
preferred label: біятэхналогія раслін @be
preferred label: biotecnologia vegetal @pt-br
preferred label: bioteknolojia ya mimea @sw
preferred label: биотехнологија биљака @sr
preferred label: მცენარეთა ბიოტექნოლოგია @ka
preferred label: біотехнологія рослин @uk
preferred label: biotehnologie vegetală @ro
preferred label: bitki biyoteknolojisi @tr
preferred label: 植物生物技术学 @zh
preferred label: เทคโนโลยีชีวภาพด้านพืช @th
preferred label: rastlinná biotechnológia @sk
preferred label: биотехнология растений @ru
preferred label: تكنولوجيا حيوية نباتية @ar
preferred label: rostlinná biotechnologie @cs
preferred label: Biotechnologie (Pflanze) @de
preferred label: plant biotechnology @en
preferred label: زیست‌فناوری گیاهی @fa
preferred label: biotechnologie végétale @fr
preferred label: पौध-जीवप्रोधोगिकी @hi
preferred label: növény-biotechnológia @hu
preferred label: Biotecnologia vegetale @it
preferred label: 植物バイオテクノロジー @ja
preferred label: 식물유전공학 @ko
preferred label: ເທັກໂນໂລຊີຊີວະພາບທາງພືດ @lo
preferred label: Biotechnologia roślin @pl
is used in: Fitomejoramiento

Centro de origen
type: Concept
preferred label: centru de origine @ro
preferred label: წარმოშობის ცენტრი @ka
preferred label: centro de origem @pt-br
preferred label: kitovu cha asili @sw
preferred label: menşe merkezi @tr
preferred label: Ursprungszentrum @de
preferred label: 原产物中心 @zh
preferred label: центр происхождения @ru
preferred label: Centro d'origine @it
preferred label: centre d'origine @fr
preferred label: الموطن الرئيسي @ar
preferred label: centre of origin @en
related: Fitomejoramiento

Genotipado mediante secuenciación
type: Concept
preferred label: генотипизација по секвенци @sr
preferred label: genotyping kwa mfuatano @sw
preferred label: genotip dizileme @tr
preferred label: 基因分型测序 @zh
preferred label: генотипирование посредством секвенирования @ru
preferred label: génotypage par séquençage @fr
preferred label: التركيب الوراثي بالتسلسل @ar
preferred label: genotyping-by-sequencing @en
related: Fitomejoramiento

Mejora
type: Concept
preferred label: reprodução @pt-br
preferred label: nhân giống @vi
preferred label: kuzaliana @sw
preferred label: Miglioramento genetico @it
preferred label: 육종 @ko
preferred label: تربية @ar
preferred label: šlechtění @cs
preferred label: breeding @en
preferred label: amélioration génétique @fr
preferred label: 育种 @zh
preferred label: селекція і розведення @uk
preferred label: ıslah @tr
preferred label: Züchtung @de
preferred label: Pembiakan @ms
preferred label: ప్రజననం @te
preferred label: селекция и разведение @ru
narrower: Fitomejoramiento